{"text_format":"1","workbook":"xlsx","n_sheets":6,"sheets":["Form","Modules","Regulator","Calculation table","Version","Language"],"not_rendered":{"charts":2,"images":9,"macros":1,"external_links":0,"defined_names":1,"comments":0,"pivot_tables":0},"unopened":[],"bounds":{"document_bytes":16777216,"sheet_cells":100000,"rows_first":2000,"rows_last":500,"rows_between":2000,"halvings":0,"cell_chars":16384,"cell_head_chars":4096},"cells_cut":0,"cells_raw":0,"read":"whole","date_system":"1900"}

{"sheet":"Form","index":0,"n_rows":42,"n_cols":21,"rows_kept":42,"cut":false,"hidden":false,"merged":[[16,7,16,8],[5,7,5,8],[34,9,34,10],[34,7,34,8],[0,2,1,6],[17,4,17,5],[17,7,17,8]]}
[null,null,"Blue Solar charge controller MPPT",null,null,null,null,null,null,null,null,null,{"$f":"IF(J3=6,INDEX(Language!B4:G41,29,6),IF(J3=5,INDEX(Language!B4:F35,29,1),IF(J3=4,INDEX(Language!B4:F35,29,2),IF(J3=3,INDEX(Language!B4:F35,29,3),IF(J3=2,INDEX(Language!B4:F35,29,4),INDEX(Language!B4:F35,29,5))))))","v":"Faixa de voltagem"},null,null,null,null,null,null,null,{"$f":"IF(J3=6,INDEX(Language!B4:G41,30,6),IF(J3=5,INDEX(Language!B4:F35,30,1),IF(J3=4,INDEX(Language!B4:F35,30,2),IF(J3=3,INDEX(Language!B4:F35,30,3),IF(J3=2,INDEX(Language!B4:F35,30,4),INDEX(Language!B4:F35,30,5))))))","v":"Faixa de corrente"}]
[]
[null,null,null,null,null,null,null,null,null,6]
[null,{"$f":"IF(J3=6,INDEX(Language!B4:G35,1,6),IF(J3=5,INDEX(Language!B4:G35,1,1),IF(J3=4,INDEX(Language!B4:G35,1,2),IF(J3=3,INDEX(Language!B4:G35,1,3),IF(J3=2,INDEX(Language!B4:G35,1,4),INDEX(Language!B4:G35,1,5))))))","v":"Módulo FV"},null,23]
[]
[null,{"$f":"IF(J3=6,INDEX(Language!B4:G35,2,6),IF(J3=5,INDEX(Language!B4:F35,2,1),IF(J3=4,INDEX(Language!B4:F35,2,2),IF(J3=3,INDEX(Language!B4:F35,2,3),IF(J3=2,INDEX(Language!B4:F35,2,4),INDEX(Language!B4:F35,2,5))))))","v":"Quantos módulos? Em serie:"},null,2,null,null,{"$f":"IF(J3=6,INDEX(Language!B4:G35,3,6),IF(J3=5,INDEX(Language!B4:F35,3,1),IF(J3=4,INDEX(Language!B4:F35,3,2),IF(J3=3,INDEX(Language!B4:F35,3,3),IF(J3=2,INDEX(Language!B4:F35,3,4),INDEX(Language!B4:F35,3,5))))))","v":"Em paralelo"},3]
[]
[null,{"$f":"IF(J3=6,INDEX(Language!B4:G35,4,6),IF(J3=5,INDEX(Language!B4:F35,4,1),IF(J3=4,INDEX(Language!B4:F35,4,2),IF(J3=3,INDEX(Language!B4:F35,4,3),IF(J3=2,INDEX(Language!B4:F35,4,4),INDEX(Language!B4:F35,4,5))))))","v":"Potência total FV @STC"},null,{"$f":"D6*H6*INDEX(Modules!B3:J34,Form!D4,3)","v":2400},{"$f":"IF(J3=6,INDEX(Language!B4:G35,5,6),IF(J3=5,INDEX(Language!B4:F35,5,1),IF(J3=4,INDEX(Language!B4:F35,5,2),IF(J3=3,INDEX(Language!B4:F35,5,3),IF(J3=2,INDEX(Language!B4:F35,5,4),INDEX(Language!B4:F35,5,5))))))","v":"Wp"}]
[null,{"$f":"IF(G24=\"N.A.\",\"\",IF('Calculation table'!C49>1.3,IF(J3=6,INDEX(Language!B4:G51,39,6),IF(J3=5,INDEX(Language!B4:F42,39,1),IF(J3=4,INDEX(Language!B4:F42,39,2),IF(J3=3,INDEX(Language!B4:F42,39,3),IF(J3=2,INDEX(Language!B4:F42,39,4),INDEX(Language!B4:F42,39,5)))))),\"\"))","v":""}]
[null,{"$f":"IF(G25=\"N.A.\",\"\",IF('Calculation table'!E50=TRUE,IF(J3=6,INDEX(Language!B4:G52,49,6),IF(J3=5,INDEX(Language!B4:F52,49,1),IF(J3=4,INDEX(Language!B4:F52,49,2),IF(J3=3,INDEX(Language!B4:F52,49,3),IF(J3=2,INDEX(Language!B4:F52,49,4),INDEX(Language!B4:F52,49,5)))))),\"\"))","v":""}]
[null,{"$f":"IF(J3=6,INDEX(Language!B4:G35,6,6),IF(J3=5,INDEX(Language!B4:F35,6,1),IF(J3=4,INDEX(Language!B4:F35,6,2),IF(J3=3,INDEX(Language!B4:F35,6,3),IF(J3=2,INDEX(Language!B4:F35,6,4),INDEX(Language!B4:F35,6,5))))))","v":"Temp. módulo FV "},"°C",{"$f":"IF(J3=6,INDEX(Language!B4:G35,7,6),IF(J3=5,INDEX(Language!B4:F35,7,1),IF(J3=4,INDEX(Language!B4:F35,7,2),IF(J3=3,INDEX(Language!B4:F35,7,3),IF(J3=2,INDEX(Language!B4:F35,7,4),INDEX(Language!B4:F35,7,5))))))","v":"Min."},{"$f":"IF(B12=1, F12, ((F12)*9/5)+32)","v":0},{"$f":"IF(B12=1, \"°C\", \"°F\")","v":"°C"},{"$f":"IF(J3=6,INDEX(Language!B4:G35,8,6),IF(J3=5,INDEX(Language!B4:F35,8,1),IF(J3=4,INDEX(Language!B4:F35,8,2),IF(J3=3,INDEX(Language!B4:F35,8,3),IF(J3=2,INDEX(Language!B4:F35,8,4),INDEX(Language!B4:F35,8,5))))))","v":"Max."},{"$f":"IF(B12=1, H12, (H12*9/5)+32)","v":70},{"$f":"IF(B12=1, \"°C\", \"°F\")","v":"°C"},null,null,null,null,2.5]
[null,1,"°F",null,40,{"$f":"E12-40","v":0},null,70,null,null,null,null,{"$f":"INDEX(Regulator!K2:N18,Form!$D$13,1)","v":12},4]
[null,{"$f":"IF(J3=6,INDEX(Language!B4:G35,9,6),IF(J3=5,INDEX(Language!B4:F35,9,1),IF(J3=4,INDEX(Language!B4:F35,9,2),IF(J3=3,INDEX(Language!B4:F35,9,3),IF(J3=2,INDEX(Language!B4:F35,9,4),INDEX(Language!B4:F35,9,5))))))","v":"Controlador"},null,9,null,null,null,null,null,null,null,null,{"$f":"INDEX(Regulator!K2:N18,Form!$D$13,2)","v":24},6]
[null,null,null,null,null,null,null,null,null,null,null,null,{"$f":"INDEX(Regulator!K2:N18,Form!$D$13,3)","v":36},10]
[null,{"$f":"IF(J3=6,INDEX(Language!B4:G35,10,6),IF(J3=5,INDEX(Language!B4:F35,10,1),IF(J3=4,INDEX(Language!B4:F35,10,2),IF(J3=3,INDEX(Language!B4:F35,10,3),IF(J3=2,INDEX(Language!B4:F35,10,4),INDEX(Language!B4:F35,10,5))))))","v":"Voltagem do sistema "},null,null,4,null,"Volt",null,null,null,null,null,{"$f":"INDEX(Regulator!K2:N18,Form!$D$13,4)","v":48},16]
[null,null,null,null,null,null,null,null,null,null,null,null,null,25]
[null,{"$f":"IF(J3=6,INDEX(Language!B4:G35,31,6),IF(J3=5,INDEX(Language!B4:F35,31,1),IF(J3=4,INDEX(Language!B4:F35,31,2),IF(J3=3,INDEX(Language!B4:F35,31,3),IF(J3=2,INDEX(Language!B4:F35,31,4),INDEX(Language!B4:F35,31,5))))))","v":"Comprimento do cabo entre o modulo e o MPPT *"},null,null,null,null,null,10,null,3,null,null,null,35]
[null,{"$f":"IF(J3=6,INDEX(Language!B4:G35,32,6),IF(J3=5,INDEX(Language!B4:F35,32,1),IF(J3=4,INDEX(Language!B4:F35,32,2),IF(J3=3,INDEX(Language!B4:F35,32,3),IF(J3=2,INDEX(Language!B4:F35,32,4),INDEX(Language!B4:F35,32,5))))))","v":"Corte transversal:"},null,null,null,null,null,{"$f":"INDEX(N11:N17,J17,1)","v":6}]
[null,{"$f":"IF(J3=6,INDEX(Language!B4:G36,33,6),IF(J3=5,INDEX(Language!B4:F36,33,1),IF(J3=4,INDEX(Language!B4:F36,33,2),IF(J3=3,INDEX(Language!B4:F36,33,3),IF(J3=2,INDEX(Language!B4:F36,33,4),INDEX(Language!B4:F36,33,5))))))","v":" * Distância de um só cabo"}]
[null,{"$f":"IF(J3=6,INDEX(Language!B4:G36,11,6),IF(J3=5,INDEX(Language!B4:F35,11,1),IF(J3=4,INDEX(Language!B4:F35,11,2),IF(J3=3,INDEX(Language!B4:F35,11,3),IF(J3=2,INDEX(Language!B4:F35,11,4),INDEX(Language!B4:F35,11,5))))))","v":"Voltagem máxima de entrada "},null,null,null,null,{"$f":"INDEX(Regulator!$B$2:$H$18,Form!$D$13,7)","v":150}]
{"$rows_left_out":23}
{"sheet":"Modules","index":1,"n_rows":45,"n_cols":11,"rows_kept":45,"cut":false,"hidden":false,"merged":[]}
[null,"Manufacturer","Type","Power","Vmpp","Impp","Voc","Isc","V temp coeff","I temp coeff","Art.Nr."]
[null,"[name]","[name]","[W]","[V]","[A]","[V]","[A]","[%/°C]","[%/°C]"]
[{"$f":"B3&\" \"&C3&\" (\"&K3&\")\"","v":"Victron Energy SPM20-12 (SPM040201200)"},"Victron Energy","SPM20-12",20,"18,5",1.0900000000000001,22.6,1.19,-0.35,0.04,"SPM040201200"]
[{"$f":"B4&\" \"&C4&\" (\"&K4&\")\"","v":"Victron Energy SPM30-12 (SPM040301200)"},"Victron Energy","SPM30-12",30,18.7,1.61,22.87,1.76,-0.34,3.6999999999999998E-2,"SPM040301200"]
["Victron Energy SPM40-12 (SPM040401200)","Victron Energy","SPM40-12",40,18.3,2.19,22.45,2.4,-0.35,0.04,"SPM040401200"]
["Victron Energy SPM55-12 (SPM040551200)","Victron Energy","SPM55-12",55,18.8,2.94,22.9,3.22,-0.35,0.04,"SPM040551200"]
["Victron Energy SPM90-12 (SPM040901200 )","Victron Energy","SPM90-12",90,19.600000000000001,4.59,24.06,5.03,-0.35,0.04,"SPM040901200 "]
["Victron Energy SPM115-12 (SPM041151200)","Victron Energy","SPM115-12",115,19,6.04,23.32,6.61,-0.35,0.04,"SPM041151200"]
["Victron Energy SPM175-12 (SPM041751200)","Victron Energy","SPM175-12",175,19.399999999999999,9.0299999999999994,23.7,9.89,-0.35,0.04,"SPM041751200"]
[{"$f":"B10&\" \"&C10&\" (\"&K10&\")\"","v":"Victron Energy SPM215-24 (SPM042152400)"},"Victron Energy","SPM215-24",215,37.4,5.75,45.82,6.3,-0.35,0.04,"SPM042152400"]
["Victron Energy SPM305-20 (SPM043052000)","Victron Energy","SPM305-20",305,32.5,9.3800000000000008,39.700000000000003,10.27,-0.35,0.04,"SPM043052000"]
["Victron Energy SPM360-24 (SPM043602400)","Victron Energy","SPM360-24",360,38.4,9.3800000000000008,47.4,10.24,-0.35,0.04,"SPM043602400"]
["Victron Energy SPP20-12 (SPP040201200)","Victron Energy","SPP20-12",20,18.399999999999999,1.0900000000000001,21.96,1.18,-0.35,0.04,"SPP040201200"]
["Victron Energy SPP30-12 (SPP040301200)","Victron Energy","SPP30-12",30,18.2,1.66,21.8,1.8,-0.35,0.04,"SPP040301200"]
[{"$f":"B15&\" \"&C15&\" (\"&K15&\")\"","v":"Victron Energy SPP45-12 (SPP040451200)"},"Victron Energy","SPP45-12",45,19.100000000000001,2.36,22.9,2.5499999999999998,-0.35,0.04,"SPP040451200"]
["Victron Energy SPP60-12 (SPP040601200)","Victron Energy","SPP60-12",60,19.3,3.12,23.1,3.37,-0.35,0.04,"SPP040601200"]
["Victron Energy SPP90-12 (SPP040901200)","Victron Energy","SPP90-12",90,19.5,4.6100000000000003,23.44,4.9800000000000004,-0.35,0.04,"SPP040901200"]
["Victron Energy SPP100-12 (SPP041001200)","Victron Energy","SPP100-12",100,18.2,5.5,21.85,5.94,-0.35,3.6999999999999998E-2,"SPP041001200"]
[{"$f":"B19&\" \"&C19&\" (\"&K19&\")\"","v":"Victron Energy SPP115-12 (SPP041151200)"},"Victron Energy","SPP115-12",115,18.940000000000001,6.08,22.73,6.56,-0.35,0.04,"SPP041151200"]
["Victron Energy SPP175-12 (SPP041751200)","Victron Energy","SPP175-12",175,18.3,9.56,21.9,10.24,-0.35,0.04,"SPP041751200"]
{"$rows_left_out":26}
{"sheet":"Regulator","index":2,"n_rows":18,"n_cols":20,"rows_kept":18,"cut":false,"hidden":false,"merged":[[0,10,0,13]]}
[null,"Manufacturer","Type","Power @ 12V","Power @ 24V","Power @ 36V","Power @ 48V","Voc max","Voc min","Vmpp min","System Voltage",null,null,null,"IPV max","Ibat max","Efficiency@12","Efficiency@24","Efficiency@36","Efficiency@48"]
[{"$f":"B2&\" \"&C2","v":"Victron Energy Blue-/ SmartSolar MPPT 75/10"},"Victron Energy","Blue-/ SmartSolar MPPT 75/10",135,270,0,0,75,5,1,12,24,"N.A.","N.A.",13,10,0.98,0.98,0,0]
["Victron Energy Blue-/ SmartSolar MPPT 75/15","Victron Energy","Blue-/ SmartSolar MPPT 75/15",200,400,0,0,75,5,1,12,24,"N.A.","N.A.",15,15,0.98,0.98,0,0]
["Victron Energy Blue-/ SmartSolar MPPT 100/15","Victron Energy","Blue-/ SmartSolar MPPT 100/15",200,400,0,0,100,5,1,12,24,"N.A.","N.A.",15,15,0.98,0.98,0,0]
["Victron Energy Smart Solar MPPT 100/20","Victron Energy","Smart Solar MPPT 100/20",290,580,0,0,100,5,1,12,24,"N.A.","N.A.",20,20,0.98,0.98,0,0]
["Victron Energy Smart Solar MPPT 100/20 48V","Victron Energy","Smart Solar MPPT 100/20 48V",0,0,0,1160,100,5,1,"N.A.","N.A.","N.A.",48,20,20,0,0,0,0.98]
["Victron Energy Blue-/ SmartSolar MPPT 100/30","Victron Energy","Blue-/ SmartSolar MPPT 100/30",440,880,0,0,100,5,1,12,24,"N.A.","N.A.",30,30,0.98,0.98,0,0]
["Victron Energy Blue-/ SmartSolar MPPT 100/50","Victron Energy","Blue-/ SmartSolar MPPT 100/50",700,1400,0,0,100,5,1,12,24,"N.A.","N.A.",50,50,0.98,0.98,0,0]
["Victron Energy Blue-/ SmartSolar MPPT 150/35","Victron Energy","Blue-/ SmartSolar MPPT 150/35",500,1000,1500,2000,150,5,1,12,24,36,48,40,35,0.98,0.98,0.98,0.98]
["Victron Energy Blue-/ SmartSolar MPPT 150/45 Tr/MC4","Victron Energy","Blue-/ SmartSolar MPPT 150/45 Tr/MC4",650,1300,null,2600,150,5,1,12,24,36,48,50,45,0.98,0.98,0.98,0.98]
["Victron Energy Blue-/ SmartSolar MPPT 150/60 Tr/MC4","Victron Energy","Blue-/ SmartSolar MPPT 150/60 Tr/MC4",860,1720,null,3440,150,5,1,12,24,36,48,50,60,0.98,0.98,0.98,0.98]
["Victron Energy Blue-/ SmartSolar MPPT 150/70 Tr/Tr VE.Can/MC4","Victron Energy","Blue-/ SmartSolar MPPT 150/70 Tr/Tr VE.Can/MC4",1000,2000,null,4000,150,5,1,12,24,36,48,50,70,0.98,0.98,0.98,0.98]
["Victron Energy SmartSolar MPPT 150/85 Tr/Tr VE.Can/MC4","Victron Energy","SmartSolar MPPT 150/85 Tr/Tr VE.Can/MC4",1200,2400,null,4900,150,5,1,12,24,36,48,70,85,0.98,0.98,0.98,0.98]
["Victron Energy SmartSolar MPPT 150/100 Tr/Tr VE.Can/MC4","Victron Energy","SmartSolar MPPT 150/100 Tr/Tr VE.Can/MC4",1450,2900,null,5800,150,5,1,12,24,36,48,70,100,0.98,0.98,0.98,0.98]
["Victron Energy SmartSolar MPPT 250/60 Tr/MC4","Victron Energy","SmartSolar MPPT 250/60 Tr/MC4",860,1720,null,3440,250,5,1,12,24,36,48,35,60,0.99,0.99,0.99,0.99]
["Victron Energy SmartSolar MPPT 250/70 Tr/Tr VE.Can/MC4","Victron Energy","SmartSolar MPPT 250/70 Tr/Tr VE.Can/MC4",1000,2000,null,4000,250,5,1,12,24,36,48,35,70,0.99,0.99,0.99,0.99]
["Victron Energy SmartSolar MPPT 250/85 Tr/Tr VE.Can/MC4","Victron Energy","SmartSolar MPPT 250/85 Tr/Tr VE.Can/MC4",1200,2400,null,4900,250,5,1,12,24,36,48,70,85,0.99,0.99,0.99,0.99]
["Victron Energy SmartSolar MPPT 250/100 Tr/Tr VE.Can/MC4","Victron Energy","SmartSolar MPPT 250/100 Tr/Tr VE.Can/MC4",1450,2900,null,5800,250,5,1,12,24,36,48,70,100,0.99,0.99,0.99,0.99]

{"sheet":"Calculation table","index":3,"n_rows":50,"n_cols":11,"rows_kept":50,"cut":false,"hidden":false,"merged":[]}
[]
["DATA:"]
[]
["Location:",null,{"$f":"Form!F12","v":0},"min",{"$f":"Form!E11","v":0}]
[null,null,{"$f":"Form!H12","v":70},"max",{"$f":"Form!H11","v":70}]
[]
["Module info:",null,{"$f":"INDEX(Modules!B3:J34,Form!D4,6)*Form!D6","v":99.6},"Voc @25°C"]
[null,null,{"$f":"INDEX(Modules!B3:J34,Form!D4,4)*Form!D6","v":83.4},"Vmpp @25°C"]
[null,null,{"$f":"INDEX(Modules!B3:J34,Form!D4,7)*Form!H6","v":31.08},"Isc PV@25°C"]
[null,null,{"$f":"INDEX(Modules!B3:J34,Form!D4,5)*Form!H6","v":28.799999999999997},"Impp PV @25°C"]
[null,null,{"$f":"$C$10*$C$8/E20","v":50.04},"Impp output @25°C"]
[null,null,{"$f":"INDEX(Modules!B3:J34,Form!D4,8)","v":-0.28000000000000003},"Temp. Coeff. Voc"]
[null,null,{"$f":"(C7/100)*C12","v":-0.27888000000000002},"Temp. Coeff. Voc absolute"]
[null,null,{"$f":"INDEX(Modules!B3:J34,Form!D4,9)","v":4.8000000000000001E-2},"Temp. Coeff. Isc"]
[null,null,{"$f":"C9*(C14/100)","v":1.49184E-2},"Temp. Coeff. Isc absolute"]
[null,null,{"$f":"Form!D8","v":2400},"Choosen PV power"]
[]
["Regulator info:",null,{"$f":"INDEX(Regulator!$B$2:$H$18,Form!$D$13,7)","v":150},"Voc max",{"$f":"INDEX(Regulator!B2:P18,Form!$D$13,15)","v":45},"Ibat max"]
[null,null,{"$f":"INDEX(Regulator!B2:J18,Form!D13,8)+E20","v":53},"Voc min",{"$f":"INDEX(Regulator!B2:P18,Form!$D$13,14)","v":50},"IPV max"]
[null,null,{"$f":"INDEX(Regulator!$B$2:$J$29,Form!$E$15,9)+E20","v":49},"Vmpp min",{"$f":"IF(INDEX(Form!$M$12:$M$15,Form!$E$15,1)=\"N.A.\",0,INDEX(Form!$M$12:$M$15,Form!$E$15,1))","v":48},"System voltage",{"$f":"IF(E20=12,16,IF(E20=24,17,IF(E20=36,18,19)))","v":19}]
{"$rows_left_out":31}
{"sheet":"Version","index":4,"n_rows":30,"n_cols":2,"rows_kept":30,"cut":false,"hidden":false,"merged":[]}
["History"]
[]
["3.6","'- Added Portuguese language"]
["3.5","'- Added new VE.Can MPPT's 150/85 & 250/85 VE.Can"]
["3.4","'- Added new VE.Can MPPT's 250/70 & 250/100 VE.Can"]
["3.3","'- Added new VE.Can MPPT's and deleted old VE.Can MPPT's 150/70 & 150/85"]
["3.2","'- Added new Victron solar modules inserted new VE.Can MPPT's and deleted old VE.Can MPPT's 150/70 & 150/85"]
["3.1","'- Added new Victron solar modules"]
["3.0","- Added Imperial system and reduced min. solar module temperature to -40°C"]
["2.9","- Added new Victron solar modules"]
[2.8,"- Added MPPT 100/20 48V & exchanged new solar modules mono 160/200/340 & poly 150/260/320Wp"]
[2.7,"- Added 150Wp mono module, SmartSolar 250/60 & 70 and maximum input current"]
[2.6,"- Added Smart Regulators and SmartSolar 100/20"]
[2.5,"- Added translations for 'coefficient support' in the modules TAB"]
[2.4,"- Bug fixed for max. charge current calculations"]
[2.2999999999999998,"- Replaced solar modules according newest list. Added 2 SmartSolar MPPT's 250/85 & 250/100 & a remark when the PV generator is oversized. "]
[2.2000000000000002,"- Added the MPPT 150/85 Tr/MC4 and 150/100 Tr/MC4 & added two cable sizes 16mm² & 35mm²"]
["2.1","- Added the Poly module with 190Wp & added the new VE.Direct MPPT's 150/45, 150/60 & 150/70, small correction in cable loss voltage"]
["2.0","- Added the MPPT 75/10 and took out the discontinued 75/50"]
["1.9","- Added new solar modules, and now 10 additional modules can be added instead of 3."]
{"$rows_left_out":11}
{"sheet":"Language","index":5,"n_rows":52,"n_cols":7,"rows_kept":52,"cut":false,"hidden":true,"merged":[]}
[null,{"$f":"IF(Form!J3=5,\"V\",\" \")","v":" "},{"$f":"IF(Form!J3=4,\"V\",\" \")","v":" "},{"$f":"IF(Form!J3=3,\"V\",\" \")","v":" "},{"$f":"IF(Form!J3=2,\"V\",\" \")","v":" "},{"$f":"IF(Form!J3=1,\"V\",\" \")","v":" "}]
["Pos.","ENGLISH","DUTCH","ESPANGOL","DEUTSCH","FRANCAIS","PORTUGUÊS"]
[]
[1,"Module:","Paneel:","Módulo FV:","Modul:","Panneau:","Módulo FV"]
[2,"In series:","In serie:","Cuantos módulos? En Serie:","In Reihe:","En serie:","Quantos módulos? Em serie:"]
[3,"Parallel:","Parallel:","En paralelo:","Parallel:","Parallèle:","Em paralelo"]
[4,"Total PV power @STC:","Totale PV vermogen @STC:","Potencia total FV @STC:","PV Leistung insgesamt @STC:","Puissance PV totale @STC:","Potência total FV @STC"]
[5,"Wp","Wp","Wp","Wp","Wc","Wp"]
[6,"Module temperature:","Paneel temperatuur:","Temp. módulo FV ","Modul Temperatur:","Température Paneau:","Temp. módulo FV "]
[7,"Min.","Min.","Min.","Min.","Min.","Min."]
[8,"Max. ","Max.","Max.","Max.","Max.","Max."]
[9,"Controller:","Regelaar:","Reguladorr:","Regler:","Régulateur:","Controlador"]
[10,"System voltage:","Systeem spanning:","Voltaje del sistema:","System Spannung:","Tension du système:","Voltagem do sistema "]
[11,"Max. input voltage","Max. ingangsspanning","Voltaje max. de entrada","Max. Eingangspannung:","Tension d'entrée max.:","Voltagem máxima de entrada "]
[12,"Max. PV voltage @ min. temperature","Max. PV spanning @ min. temp.","Voltaje max. FV @ Temperatura min.","Max. PV Spannung @ min. Temp.","PV tension max. @ temp. min.","Voltagem max FV@Temp min "]
[13,"Min. input voltage @ MPP","Min. ingangsspanning @ MPP","Voltaje min. de entrada  @ PMP","Min. Eingangspannung @ MPP","Tension d'entrée min. @ MPP","Voltagem min. de entrada  @ MPPT"]
[14,"Min. PV voltage @ max. temperature","Min. PV spanning @ max. Temp.","Voltaje min. FV @ Temperatura max.","Min. PV Spannung @ max. Temp.","PV tension min. @ temp. max.","Voltagem min. FV @ Temperatura max."]
[15,"Max. output current","Max. uitgangsstroom","Corriente max. de salida","Max. Ausgangstrom","Courant de sortie max.","Corrente max. de saida"]
[16,"Max. current @ MPP min. temp.","Max. stroom @ MPP min. temp.","Corriente max. @ PMP temp. min.","Max. Strom @ MPP min. Temp.","Courant max. @ MPP temp. min.","Corrente max. @ MPPT temp. min."]
[17,"Max. current @ MPP max. temp.","Max. stroom @ MPP max. temp.","Corriente max. @ PMP temp. max.","Max. Strom @ MPP max. Temp.","Courant max. @ MPP temp. max.","Corrente max. @ MPPT temp. max."]
{"$rows_left_out":32}